Target
Aminopeptidase B
Ligand
BDBM50008434
Substrate
Meas. Tech.
ChEBML_36049
Ki
170±n/a nM
Citation
 Ocain, TDRich, DH alpha-Keto amide inhibitors of aminopeptidases. J Med Chem 35:451-6 (1992)  
Target
Name:
Aminopeptidase B
Synonyms:
AMPB_HUMAN Aminopeptidase Arginine aminopeptidase RNPEP
Type:
PROTEIN
Mol. Mass.:
72586.33
Organism:
Homo sapiens (Human)
Description:
ChEMBL_36048
Residue:
650
  
Inhibitor
Name:
BDBM50008434
Synonyms:
5-Amino-2-benzyl-7-methyl-4-oxo-octanoic acid | CHEMBL140459
Type:
Small organic molecule
Emp. Form.:
C16H23NO3
Mol. Mass.:
277.3587
SMILES:
CC(C)C[C@H](N)C(=O)CC(Cc1ccccc1)C(O)=O
: