Target
Aminopeptidase B
Ligand
BDBM50008428
Substrate
Meas. Tech.
ChEBML_36049
Ki
>300000±n/a nM
Citation
 Ocain, TDRich, DH alpha-Keto amide inhibitors of aminopeptidases. J Med Chem 35:451-6 (1992)  
Target
Name:
Aminopeptidase B
Synonyms:
AMPB_HUMAN Aminopeptidase Arginine aminopeptidase RNPEP
Type:
PROTEIN
Mol. Mass.:
72586.33
Organism:
Homo sapiens (Human)
Description:
ChEMBL_36048
Residue:
650
  
Inhibitor
Name:
BDBM50008428
Synonyms:
3-Amino-2-hydroxy-5-methyl-hexanoic acid (3-methyl-butyl)-amide | CHEMBL142010
Type:
Small organic molecule
Emp. Form.:
C12H26N2O2
Mol. Mass.:
230.347
SMILES:
CC(C)CCNC(=O)[C@@H](O)[C@H](N)CC(C)C
: