Target
Aldo-keto reductase family 1 member B1
Ligand
BDBM50008441
Substrate
Meas. Tech.
ChEBML_31764
IC50
6.4±n/a nM
Citation
 Mylari, BLBeyer, TAScott, PJAldinger, CEDee, MFSiegel, TWZembrowski, WJ Potent, orally active aldose reductase inhibitors related to zopolrestat: surrogates for benzothiazole side chain. J Med Chem 35:457-65 (1992)  
Target
Name:
Aldo-keto reductase family 1 member B1
Synonyms:
AKR1B1 ALDR_HUMAN AR Aldose Reductase (ALR2) Aldose reductase (AR)
Type:
Protein
Mol. Mass.:
35855.50
Organism:
Homo sapiens (Human)
Description:
P15121. 4LAU; 2IKI; 4LB4; 2FZD; 2FZ8; 1US0
Residue:
316
  
Inhibitor
Name:
BDBM50008441
Synonyms:
CHEMBL422647 | [4-Oxo-3-(3-o-tolyl-[1,2,4]oxadiazol-5-ylmethyl)-3,4-dihydro-phthalazin-1-yl]-acetic acid
Type:
Small organic molecule
Emp. Form.:
C20H16N4O4
Mol. Mass.:
376.3654
SMILES:
Cc1ccccc1-c1noc(Cn2nc(CC(O)=O)c3ccccc3c2=O)n1
: