Target
Aldo-keto reductase family 1 member B1
Ligand
BDBM50230363
Substrate
Meas. Tech.
ChEMBL_31764 (CHEMBL641358)
IC50
<10±n/a nM
Citation
 Mylari, BLBeyer, TAScott, PJAldinger, CEDee, MFSiegel, TWZembrowski, WJ Potent, orally active aldose reductase inhibitors related to zopolrestat: surrogates for benzothiazole side chain. J Med Chem 35:457-65 (1992)  
Target
Name:
Aldo-keto reductase family 1 member B1
Synonyms:
AKR1B1 ALDR_HUMAN AR Aldose Reductase (ALR2) Aldose reductase (AR)
Type:
Protein
Mol. Mass.:
35855.50
Organism:
Homo sapiens (Human)
Description:
P15121. 4LAU; 2IKI; 4LB4; 2FZD; 2FZ8; 1US0
Residue:
316
  
Inhibitor
Name:
BDBM50230363
Synonyms:
CHEMBL422476
Type:
Small organic molecule
Emp. Form.:
C19H13FN4O4
Mol. Mass.:
380.3293
SMILES:
OC(=O)Cc1nn(Cc2nc(no2)-c2ccccc2F)c(=O)c2ccccc12
: