Target
Acetylcholinesterase
Ligand
BDBM50008554
Substrate
Meas. Tech.
ChEMBL_29410 (CHEMBL643383)
IC50
380±n/a nM
Citation
 Cardozo, MGIimura, YSugimoto, HYamanishi, YHopfinger, AJ QSAR analyses of the substituted indanone and benzylpiperidine rings of a series of indanone-benzylpiperidine inhibitors of acetylcholinesterase. J Med Chem 35:584-9 (1992)  
Target
Name:
Acetylcholinesterase
Synonyms:
ACES_HUMAN Acetylcholinesterase (AChE) | Acetylcholinesterase (human AChE)
Type:
Enzyme
Mol. Mass.:
67792.70
Organism:
Homo sapiens (Human)
Description:
P22303
Residue:
614
  
Inhibitor
Name:
BDBM50008554
Synonyms:
6-Fluoro-2-methyl-indan-1-one | CHEMBL155499
Type:
Small organic molecule
Emp. Form.:
C10H9FO
Mol. Mass.:
164.1763
SMILES:
CC1Cc2ccc(F)cc2C1=O
: