Target
Neprilysin
Ligand
BDBM50008610
Substrate
Meas. Tech.
ChEMBL_64516 (CHEMBL677321)
IC50
7.4±n/a nM
Citation
 Mimura, TNakamura, YNishino, JSawayama, TKomiya, TDeguchi, TKita, ANakamura, HMatsumoto, J A novel class of enkephalinase inhibitors containing a C-terminal sulfo group. J Med Chem 35:602-8 (1992)  
Target
Name:
Neprilysin
Synonyms:
Mme Neprilysin Neutral endopeptidase 24.11
Type:
Protein
Mol. Mass.:
85789.59
Organism:
Rattus norvegicus (Rat)
Description:
P07861
Residue:
750
  
Inhibitor
Name:
BDBM50008610
Synonyms:
CHEMBL156013 | Sodium; 4-(2-mercaptomethyl-3-phenyl-propionylamino)-naphthalene-1-sulfonate (1.75H2O)
Type:
Small organic molecule
Emp. Form.:
C20H18NO4S2
Mol. Mass.:
400.492
SMILES:
[O-]S(=O)(=O)c1ccc(NC(=O)C(CS)Cc2ccccc2)c2ccccc12
: