Target
Angiotensin-converting enzyme
Ligand
BDBM21641
Substrate
Meas. Tech.
ChEBML_35064
IC50
420±n/a nM
Citation
 Mimura, TNakamura, YNishino, JSawayama, TKomiya, TDeguchi, TKita, ANakamura, HMatsumoto, J A novel class of enkephalinase inhibitors containing a C-terminal sulfo group. J Med Chem 35:602-8 (1992)  
Target
Name:
Angiotensin-converting enzyme
Synonyms:
3.2.1.- ACE Angiotensin-converting enzyme, soluble form DCP1 Kininase II
Type:
Mol. Mass.:
150405.15
Organism:
Oryctolagus cuniculus
Description:
Residue:
1310
  
Inhibitor
Name:
BDBM21641
Synonyms:
2-(2-benzyl-3-sulfanylpropanamido)acetic acid Thiorphan
Type:
Small organic molecule
Emp. Form.:
C12H15NO3S
Mol. Mass.:
253.317
SMILES:
OC(=O)CNC(=O)C(CS)Cc1ccccc1
: