Target
Cholecystokinin receptor type A
Ligand
BDBM50008638
Substrate
Meas. Tech.
ChEBML_49718
IC50
120±n/a nM
Citation
 Kerwin, JFWagenaar, FKopecka, HLin, CWMiller, TWitte, DStashko, MNadzan, AM Cholecystokinin antagonists: (R)-tryptophan-based hybrid antagonists of high affinity and selectivity for CCK-A receptors. J Med Chem 34:3350-9 (1992)  
Target
Name:
Cholecystokinin receptor type A
Synonyms:
CCK-A receptor CCK1-R CCKAR_CAVPO Cholecystokinin receptor type A | Cholecystokinin-1 receptor
Type:
Mol. Mass.:
48229.77
Organism:
Cavia porcellus
Description:
Residue:
430
  
Inhibitor
Name:
BDBM50008638
Synonyms:
(R)-Quinoline-2-carboxylic acid [1-dipentylcarbamoyl-2-(1H-indol-3-yl)-ethyl]-amide | CHEMBL324652
Type:
Small organic molecule
Emp. Form.:
C31H38N4O2
Mol. Mass.:
498.659
SMILES:
CCCCCN(CCCCC)C(=O)[C@@H](Cc1c[nH]c2ccccc12)NC(=O)c1ccc2ccccc2n1
: