Target
Cholecystokinin receptor type A
Ligand
BDBM50008636
Substrate
Meas. Tech.
ChEBML_49718
IC50
14600±n/a nM
Citation
 Kerwin, JFWagenaar, FKopecka, HLin, CWMiller, TWitte, DStashko, MNadzan, AM Cholecystokinin antagonists: (R)-tryptophan-based hybrid antagonists of high affinity and selectivity for CCK-A receptors. J Med Chem 34:3350-9 (1992)  
Target
Name:
Cholecystokinin receptor type A
Synonyms:
CCK-A receptor CCK1-R CCKAR_CAVPO Cholecystokinin receptor type A | Cholecystokinin-1 receptor
Type:
Mol. Mass.:
48229.77
Organism:
Cavia porcellus
Description:
Residue:
430
  
Inhibitor
Name:
BDBM50008636
Synonyms:
(R)-N-[1-Dipentylcarbamoyl-2-(1H-indol-3-yl)-ethyl]-nicotinamide | CHEMBL322031
Type:
Small organic molecule
Emp. Form.:
C27H36N4O2
Mol. Mass.:
448.6003
SMILES:
CCCCCN(CCCCC)C(=O)[C@@H](Cc1c[nH]c2ccccc12)NC(=O)c1cccnc1
: