Target
Cholecystokinin receptor type A
Ligand
BDBM50008650
Substrate
Meas. Tech.
ChEBML_49718
IC50
1500±n/a nM
Citation
 Kerwin, JFWagenaar, FKopecka, HLin, CWMiller, TWitte, DStashko, MNadzan, AM Cholecystokinin antagonists: (R)-tryptophan-based hybrid antagonists of high affinity and selectivity for CCK-A receptors. J Med Chem 34:3350-9 (1992)  
Target
Name:
Cholecystokinin receptor type A
Synonyms:
CCK-A receptor CCK1-R CCKAR_CAVPO Cholecystokinin receptor type A | Cholecystokinin-1 receptor
Type:
Mol. Mass.:
48229.77
Organism:
Cavia porcellus
Description:
Residue:
430
  
Inhibitor
Name:
BDBM50008650
Synonyms:
(S)-3-(1H-Indol-3-yl)-N,N-dipentyl-2-(3-m-tolyl-ureido)-propionamide | CHEMBL114997
Type:
Small organic molecule
Emp. Form.:
C29H40N4O2
Mol. Mass.:
476.6535
SMILES:
CCCCCN(CCCCC)C(=O)[C@H](Cc1c[nH]c2ccccc12)NC(=O)Nc1cccc(C)c1
: