Target
Cysteine protease
Ligand
BDBM50258498
Substrate
Meas. Tech.
ChEBML_1690561
Ki
7.5±n/a nM
Citation
 Previti, SEttari, RCosconati, SAmendola, GChouchene, KWagner, AHellmich, UAUlrich, KKrauth-Siegel, RLWich, PRSchmid, ISchirmeister, TGut, JRosenthal, PJGrasso, SZappalą, M Development of Novel Peptide-Based Michael Acceptors Targeting Rhodesain and Falcipain-2 for the Treatment of Neglected Tropical Diseases (NTDs). J Med Chem 60:6911-6923 (2017)  
Target
Name:
Cysteine protease
Synonyms:
Rhodesain
Type:
PROTEIN
Mol. Mass.:
48425.78
Organism:
Trypanosoma brucei rhodesiense
Description:
ChEMBL_619861
Residue:
450
  
Inhibitor
Name:
BDBM50258498
Synonyms:
CHEMBL4101714
Type:
Small organic molecule
Emp. Form.:
C27H34N2O5
Mol. Mass.:
466.5693
SMILES:
COC(=O)\C=C\[C@H](CCc1ccccc1)NC(=O)[C@H](CC(C)C)NC(=O)OCc1ccccc1
: