Target
Nitric oxide synthase, endothelial
Ligand
BDBM50258722
Substrate
Meas. Tech.
ChEBML_1690597
Ki
562±n/a nM
Citation
 Pensa, AVCinelli, MALi, HChreifi, GMukherjee, PRoman, LJMartásek, PPoulos, TLSilverman, RB Hydrophilic, Potent, and Selective 7-Substituted 2-Aminoquinolines as Improved Human Neuronal Nitric Oxide Synthase Inhibitors. J Med Chem 60:7146-7165 (2017)  
Target
Name:
Nitric oxide synthase, endothelial
Synonyms:
Constitutive NOS Endothelial nitric oxide synthase NOS type III NOS3_BOVIN Nitric-oxide synthase, endothelial | cNOS
Type:
Enzyme
Mol. Mass.:
133292.26
Organism:
Bos taurus (bovine)
Description:
Recombinant eNOS overexpressed in E. coli was used in enzyme assays.
Residue:
1205
  
Inhibitor
Name:
BDBM50258722
Synonyms:
CHEMBL4092616
Type:
Small organic molecule
Emp. Form.:
C19H22N4
Mol. Mass.:
306.4048
SMILES:
Cc1ccncc1CCCNCc1ccc2ccc(N)nc2c1
: