Target
D(2) dopamine receptor
Ligand
BDBM50008782
Substrate
Meas. Tech.
ChEMBL_62416 (CHEMBL674821)
Ki
0.270000±n/a nM
Citation
 Bishop, JEMathis, CAGerdes, JMWhitney, JMEaton, AMMailman, RB Synthesis and in vitro evaluation of 2,3-dimethoxy-5-(fluoroalkyl)-substituted benzamides: high-affinity ligands for CNS dopamine D2 receptors. J Med Chem 34:1612-24 (1991)  
Target
Name:
D(2) dopamine receptor
Synonyms:
DOPAMINE D2 DOPAMINE D2 Short Dopamine D2 receptor Drd2
Type:
G Protein-Coupled Receptor (GPCR)
Mol. Mass.:
50931.60
Organism:
Rattus norvegicus (rat)
Description:
P61169
Residue:
444
  
Inhibitor
Name:
BDBM50008782
Synonyms:
CHEMBL44237 Epidepride;N-(1-Ethyl-pyrrolidin-2-ylmethyl)-5-iodo-2,3-dimethoxy-benzamide | N-(1-Ethyl-pyrrolidin-2-ylmethyl)-5-iodo-2,3-dimethoxy-benzamide (epidepride)
Type:
Small organic molecule
Emp. Form.:
C16H23IN2O3
Mol. Mass.:
418.2699
SMILES:
CCN1CCC[C@H]1CNC(=O)c1cc(I)cc(OC)c1OC
: