Target
Thromboxane-A synthase
Ligand
BDBM50008793
Substrate
Meas. Tech.
ChEMBL_210275 (CHEMBL808522)
IC50
78±n/a nM
Citation
 Bhagwat, SSGude, CCohen, DSLee, WFurness, PClarke, FH Thromboxane receptor antagonism combined with thromboxane synthase inhibition. 1. (+/-)-(3-pyridinylbicycloheptyl)alkanoic acids. J Med Chem 34:1790-7 (1991)  
Target
Name:
Thromboxane-A synthase
Synonyms:
CYP5 Cytochrome P450 5A1 TBXAS1 TXA synthase TXS Thromboxane A2 Synthase (P450 TxA2) Thromboxane prostanoid Thromboxane-A synthase
Type:
Enzyme
Mol. Mass.:
60524.67
Organism:
Homo sapiens (Human)
Description:
P24557
Residue:
533
  
Inhibitor
Name:
BDBM50008793
Synonyms:
6-(3-Pyridin-3-yl-bicyclo[2.2.1]hept-2-yl)-hex-4-enoic acid | CHEMBL298130
Type:
Small organic molecule
Emp. Form.:
C18H23NO2
Mol. Mass.:
285.3807
SMILES:
OC(=O)CC\C=C/C[C@@H]1C2CCC(C2)[C@H]1c1cccnc1
: