Target
Thromboxane-A synthase
Ligand
BDBM50008796
Substrate
Meas. Tech.
ChEMBL_210274 (CHEMBL808521)
IC50
165±n/a nM
Citation
 Bhagwat, SSGude, CCohen, DSLee, WFurness, PClarke, FH Thromboxane receptor antagonism combined with thromboxane synthase inhibition. 1. (+/-)-(3-pyridinylbicycloheptyl)alkanoic acids. J Med Chem 34:1790-7 (1991)  
Target
Name:
Thromboxane-A synthase
Synonyms:
CYP5 Cytochrome P450 5A1 TBXAS1 TXA synthase TXS Thromboxane A2 Synthase (P450 TxA2) Thromboxane prostanoid Thromboxane-A synthase
Type:
Enzyme
Mol. Mass.:
60524.67
Organism:
Homo sapiens (Human)
Description:
P24557
Residue:
533
  
Inhibitor
Name:
BDBM50008796
Synonyms:
8-(3-Pyridin-3-yl-bicyclo[2.2.1]hept-2-yl)-oct-6-enoic acid | CHEMBL51949
Type:
Small organic molecule
Emp. Form.:
C20H27NO2
Mol. Mass.:
313.4339
SMILES:
OC(=O)CCCC\C=C/C[C@@H]1C2CCC(C2)C1c1cccnc1
: