Target
Mu-type opioid receptor
Ligand
BDBM50452994
Substrate
Meas. Tech.
ChEMBL_146259 (CHEMBL757483)
Ki
7110±n/a nM
Citation
 Vecchietti, VGiordani, AGiardina, GColle, RClarke, GD (2S)-1-(arylacetyl)-2-(aminomethyl)piperidine derivatives: novel, highly selective kappa opioid analgesics. J Med Chem 34:397-403 (1991)  
Target
Name:
Mu-type opioid receptor
Synonyms:
M-OR-1 Mu opioid receptor OPIATE Mu OPRM_CAVPO
Type:
Enzyme Catalytic Domain
Mol. Mass.:
11165.58
Organism:
GUINEA PIG
Description:
P97266
Residue:
98
  
Inhibitor
Name:
BDBM50452994
Synonyms:
CHEMBL2111857
Type:
Small organic molecule
Emp. Form.:
C18H24Cl2N2O
Mol. Mass.:
355.302
SMILES:
Clc1ccc(CC(=O)N2CCCC[C@@H]2CN2CCCC2)cc1Cl
: