Target
Polyunsaturated fatty acid 5-lipoxygenase
Ligand
BDBM50008957
Substrate
Meas. Tech.
ChEBML_736
IC50
1800±n/a nM
Citation
 Flynn, DLBelliotti, TRBoctor, AMConnor, DTKostlan, CRNies, DEOrtwine, DFSchrier, DJSircar, JC Styrylpyrazoles, styrylisoxazoles, and styrylisothiazoles. Novel 5-lipoxygenase and cyclooxygenase inhibitors. J Med Chem 34:518-25 (1991)  
Target
Name:
Polyunsaturated fatty acid 5-lipoxygenase
Synonyms:
Alox5 LOX5_RAT
Type:
PROTEIN
Mol. Mass.:
78082.31
Organism:
Rattus norvegicus
Description:
ChEMBL_1432947
Residue:
673
  
Inhibitor
Name:
BDBM50008957
Synonyms:
2-Methoxy-4-[2-(3-methyl-isothiazol-5-yl)-vinyl]-phenol | CHEMBL146786
Type:
Small organic molecule
Emp. Form.:
C13H13NO2S
Mol. Mass.:
247.313
SMILES:
COc1cc(\C=C\c2cc(C)ns2)ccc1O
: