Target
Polyunsaturated fatty acid 5-lipoxygenase
Ligand
BDBM50008952
Substrate
Meas. Tech.
ChEBML_736
IC50
17000±n/a nM
Citation
 Flynn, DLBelliotti, TRBoctor, AMConnor, DTKostlan, CRNies, DEOrtwine, DFSchrier, DJSircar, JC Styrylpyrazoles, styrylisoxazoles, and styrylisothiazoles. Novel 5-lipoxygenase and cyclooxygenase inhibitors. J Med Chem 34:518-25 (1991)  
Target
Name:
Polyunsaturated fatty acid 5-lipoxygenase
Synonyms:
Alox5 LOX5_RAT
Type:
PROTEIN
Mol. Mass.:
78082.31
Organism:
Rattus norvegicus
Description:
ChEMBL_1432947
Residue:
673
  
Inhibitor
Name:
BDBM50008952
Synonyms:
CHEMBL357141 | {3-[2-(3,5-Di-tert-butyl-4-hydroxy-phenyl)-vinyl]-isoxazol-5-yl}-acetic acid
Type:
Small organic molecule
Emp. Form.:
C21H27NO4
Mol. Mass.:
357.4434
SMILES:
CC(C)(C)c1cc(\C=C\c2cc(CC(O)=O)on2)cc(c1O)C(C)(C)C
: