Target
Dual specificity tyrosine-phosphorylation-regulated kinase 2
Ligand
BDBM50259408
Substrate
Meas. Tech.
ChEBML_1691316
IC50
380±n/a nM
Citation
 Bendjeddou, LZLoaëc, NVilliers, BPrina, ESpäth, GFGalons, HMeijer, LOumata, N Exploration of the imidazo[1,2-b]pyridazine scaffold as a protein kinase inhibitor. Eur J Med Chem 125:696-709 (2017)  
Target
Name:
Dual specificity tyrosine-phosphorylation-regulated kinase 2
Synonyms:
DYRK2 Dual-specificity tyrosine-phosphorylation regulated kinase 2
Type:
PROTEIN
Mol. Mass.:
66690.69
Organism:
Homo sapiens (Human)
Description:
ChEMBL_1508025
Residue:
601
  
Inhibitor
Name:
BDBM50259408
Synonyms:
CHEMBL4090770
Type:
Small organic molecule
Emp. Form.:
C18H19N5O
Mol. Mass.:
321.3764
SMILES:
CC[C@@H](CO)Nc1ccc2ncc(-c3ccc4[nH]ccc4c3)n2n1
: