Target
Lysine-specific histone demethylase 1A
Ligand
BDBM50158869
Substrate
Meas. Tech.
ChEBML_1691612
IC50
24±n/a nM
Citation
 Wang, SZhao, LJZheng, YCShen, DDMiao, EFQiao, XPZhao, LJLiu, YHuang, RYu, BLiu, HM Design, synthesis and biological evaluation of [1,2,4]triazolo[1,5-a]pyrimidines as potent lysine specific demethylase 1 (LSD1/KDM1A) inhibitors. Eur J Med Chem 125:940-951 (2017)  
Target
Name:
Lysine-specific histone demethylase 1A
Synonyms:
AOF2 Flavin-containing amine oxidase domain-containing protein 2 KDM1A KIAA0601 Lysine-specific demethylase 1 (LSD1) Lysine-specific histone demethylase 1 (LSD1)
Type:
Enzyme
Mol. Mass.:
92901.01
Organism:
Homo sapiens (Human)
Description:
O60341
Residue:
852
  
Inhibitor
Name:
BDBM50158869
Synonyms:
CHEMBL3786182 US11254676, Example Control | US11873292, Compound GSK2879552
Type:
Small organic molecule
Emp. Form.:
C23H28N2O2
Mol. Mass.:
364.4806
SMILES:
OC(=O)c1ccc(CN2CCC(CN[C@@H]3C[C@H]3c3ccccc3)CC2)cc1
: