Target
Trypanothione reductase
Ligand
BDBM50259704
Substrate
Meas. Tech.
ChEBML_1691709
Ki
118000±n/a nM
Citation
 Arias, DGHerrera, FEGaray, ASRodrigues, DForastieri, PSLuna, LEBürgi, MDPrieto, CIglesias, AACravero, RMGuerrero, SA Rational design of nitrofuran derivatives: Synthesis and valuation as inhibitors of Trypanosoma cruzi trypanothione reductase. Eur J Med Chem 125:1088-1097 (2017)  
Target
Name:
Trypanothione reductase
Synonyms:
N(1),N(8)-bis(glutathionyl)spermidine reductase TR | TYTR_TRYCR
Type:
Homodimer; oxidoreductase
Mol. Mass.:
53868.26
Organism:
Trypanosoma cruzi
Description:
Residue:
492
  
Inhibitor
Name:
BDBM50259704
Synonyms:
CHEMBL4066587
Type:
Small organic molecule
Emp. Form.:
C10H15N3O4
Mol. Mass.:
241.2438
SMILES:
CN(C)CCCNC(=O)c1ccc(o1)[N+]([O-])=O
: