Target
Cysteinyl leukotriene receptor 1
Ligand
BDBM50009068
Substrate
Meas. Tech.
ChEMBL_52044 (CHEMBL884353)
IC50
100±n/a nM
Citation
 Shaw, AKrell, RD Peptide leukotrienes: current status of research. J Med Chem 34:1235-42 (1991)  
Target
Name:
Cysteinyl leukotriene receptor 1
Synonyms:
CLTR1_CAVPO | CYSLTR1
Type:
Enzyme Catalytic Domain
Mol. Mass.:
39007.58
Organism:
GUINEA PIG
Description:
Leukotriene D4 0 GUINEA PIG::Q2NNR5
Residue:
340
  
Inhibitor
Name:
BDBM50009068
Synonyms:
7-[(2E,4E,6Z,9E)-(R)-1-((R)-4-Carboxy-1-hydroxy-butyl)-pentadeca-2,4,6,9-tetraenylsulfanyl]-4-oxo-4H-chromene-2-carboxylic acid | CHEMBL21286
Type:
Small organic molecule
Emp. Form.:
C30H36O7S
Mol. Mass.:
540.668
SMILES:
CCCCC\C=C\C\C=C/C=C/C=C/[C@@H](Sc1ccc2c(c1)oc(cc2=O)C(O)=O)[C@H](O)CCCC(O)=O
: