Target
Aromatase
Ligand
BDBM9460
Substrate
Meas. Tech.
ChEMBL_50538 (CHEMBL661155)
IC50
34000±n/a nM
Citation
 Bayer, HBatzl, CHartmann, RWMannschreck, A New aromatase inhibitors. Synthesis and biological activity of pyridyl-substituted tetralone derivatives. J Med Chem 34:2685-91 (1991)  
Target
Name:
Aromatase
Synonyms:
Arom CP19A_RAT Cyp19 Cytochrome P450 19A1 P-450AROM
Type:
PROTEIN
Mol. Mass.:
58418.09
Organism:
Rattus norvegicus
Description:
ChEMBL_51211
Residue:
508
  
Inhibitor
Name:
BDBM9460
Synonyms:
3-(4-aminophenyl)-3-ethyl-piperidine-2,6-dione Aminoglutethimide AG, 4 Cytadren Elipten | aminoglutethimide (AG)
Type:
Small organic molecule
Emp. Form.:
C13H16N2O2
Mol. Mass.:
232.2783
SMILES:
CCC1(CCC(=O)NC1=O)c1ccc(N)cc1
: