Target
Diacylglycerol O-acyltransferase 1
Ligand
BDBM20716
Substrate
Meas. Tech.
ChEBML_1693733
IC50
7.8±n/a nM
Citation
 Yan, JWang, GDang, XGuo, BChen, WWang, TZeng, LWang, HHu, Y Discovery of a low-systemic-exposure DGAT-1 inhibitor with a picolinoylpyrrolidine-2-carboxylic acid moiety. Bioorg Med Chem 25:4701-4714 (2017)  
Target
Name:
Diacylglycerol O-acyltransferase 1
Synonyms:
ACAT-related gene product 1 Acyl coA-diacylglycerol acyl transferase 1 (DGAT1) DGAT1 Diacylglycerol Acyltransferase (DGAT1) Diacylglycerol O-acyltransferase 1 (DGAT1) | Diglyceride acyltransferase
Type:
Protein
Mol. Mass.:
55297.82
Organism:
Homo sapiens (Human)
Description:
O75907
Residue:
488
  
Inhibitor
Name:
BDBM20716
Synonyms:
(1R,2R)-2-[(4-{4-[(phenylcarbamoyl)amino]phenyl}phenyl)carbonyl]cyclopentane-1-carboxylic acid | Urea-based Analogue, 4a
Type:
Small organic molecule
Emp. Form.:
C26H24N2O4
Mol. Mass.:
428.4798
SMILES:
OC(=O)[C@@H]1CCC[C@H]1C(=O)c1ccc(cc1)-c1ccc(NC(=O)Nc2ccccc2)cc1
: