Target
Aldo-keto reductase family 1 member B1
Ligand
BDBM50009984
Substrate
Meas. Tech.
ChEBML_32094
IC50
8200.0±n/a nM
Citation
 DeRuiter, JDavis, RAWandrekar, VGMayfield, CA Relative structure-inhibition analyses of the N-benzoyl and N-(phenylsulfonyl) amino acid aldose reductase inhibitors. J Med Chem 34:2120-6 (1991)  
Target
Name:
Aldo-keto reductase family 1 member B1
Synonyms:
ALDR_RAT Akr1b4 Aldr1
Type:
PROTEIN
Mol. Mass.:
35797.87
Organism:
Rattus norvegicus
Description:
ChEMBL_1512484
Residue:
316
  
Inhibitor
Name:
BDBM50009984
Synonyms:
CHEMBL66216 | [(4-Fluoro-benzoyl)-phenyl-amino]-acetic acid
Type:
Small organic molecule
Emp. Form.:
C15H12FNO3
Mol. Mass.:
273.2591
SMILES:
OC(=O)CN(C(=O)c1ccc(F)cc1)c1ccccc1
: