Target
Aldo-keto reductase family 1 member B1
Ligand
BDBM50010000
Substrate
Meas. Tech.
ChEBML_32094
IC50
49000±n/a nM
Citation
 DeRuiter, JDavis, RAWandrekar, VGMayfield, CA Relative structure-inhibition analyses of the N-benzoyl and N-(phenylsulfonyl) amino acid aldose reductase inhibitors. J Med Chem 34:2120-6 (1991)  
Target
Name:
Aldo-keto reductase family 1 member B1
Synonyms:
ALDR_RAT Akr1b4 Aldr1
Type:
PROTEIN
Mol. Mass.:
35797.87
Organism:
Rattus norvegicus
Description:
ChEMBL_1512484
Residue:
316
  
Inhibitor
Name:
BDBM50010000
Synonyms:
(3-Benzoylamino-benzoylamino)-acetic acid | CHEMBL67215
Type:
Small organic molecule
Emp. Form.:
C16H14N2O4
Mol. Mass.:
298.2934
SMILES:
OC(=O)CNC(=O)c1cccc(NC(=O)c2ccccc2)c1
: