Target
Solute carrier family 2, facilitated glucose transporter member 1
Ligand
BDBM50010272
Substrate
Meas. Tech.
ChEBML_71573
Kd
>100000±n/a nM
Citation
 Robbins, JDLaurenza, AKosley, RWO'Malley, GJSpahl, BSeamon, KB (Aminoalkyl)carbamates of forskolin: intermediates for the synthesis of functionalized derivatives of forskolin with different specificities for adenylyl cyclase and the glucose transporter. J Med Chem 34:3204-12 (1991)  
Target
Name:
Solute carrier family 2, facilitated glucose transporter member 1
Synonyms:
GLUT-1 GTR1_HUMAN Glucose transporter HepG2 glucose transporter | SLC2A1
Type:
Protein
Mol. Mass.:
54091.71
Organism:
Homo sapiens (Human)
Description:
Residue:
492
  
Inhibitor
Name:
BDBM50010272
Synonyms:
CHEMBL322952 | {6-[3-(4-Hydroxy-phenyl)-propionylamino]-hexyl}-carbamic acid 5,10,10b-trihydroxy-3,4a,7,7,10a-pentamethyl-1-oxo-3-vinyl-dodecahydro-benzo[f]chromen-6-yl ester
Type:
Small organic molecule
Emp. Form.:
C36H54N2O9
Mol. Mass.:
658.822
SMILES:
CC1(C)CC[C@H](O)[C@@]2(C)[C@H]1[C@H](OC(=O)NCCCCCCNC(=O)CCc1ccc(O)cc1)[C@H](O)[C@@]1(C)O[C@](C)(CC(=O)[C@]21O)C=C
: