Target
Estrogen-related receptor gamma
Ligand
BDBM29608
Substrate
Meas. Tech.
ChEBML_1696130
IC50
4.9±n/a nM
Citation
 Torikai, KKoga, RLiu, XUmehara, KKitano, TWatanabe, KOishi, TNoguchi, HShimohigashi, Y Design and synthesis of benzoacridines as estrogenic and anti-estrogenic agents. Bioorg Med Chem 25:5216-5237 (2017)  
Target
Name:
Estrogen-related receptor gamma
Synonyms:
ERR gamma-2 ERR3_HUMAN ESRRG Estrogen-Related Receptor, gamma KIAA0832 Nuclear receptor subfamily 3 group B member 3
Type:
PROTEIN
Mol. Mass.:
51305.00
Organism:
Homo sapiens (Human)
Description:
ChEMBL_1501351
Residue:
458
  
Inhibitor
Name:
BDBM29608
Synonyms:
Bisphenol A (BPA) US9688816, L
Type:
Small organic molecule
Emp. Form.:
C15H16O2
Mol. Mass.:
228.2863
SMILES:
CC(C)(c1ccc(O)cc1)c1ccc(O)cc1
: