Target
Aldo-keto reductase family 1 member B1
Ligand
BDBM50010451
Substrate
Meas. Tech.
ChEBML_218061
Ki
1300±n/a nM
Citation
 Deck, LMVander Jagt, DLRoyer, RE Gossypol and derivatives: a new class of aldose reductase inhibitors. J Med Chem 34:3301-5 (1991)  
Target
Name:
Aldo-keto reductase family 1 member B1
Synonyms:
AKR1B1 ALDR_HUMAN AR Aldose Reductase (ALR2) Aldose reductase (AR)
Type:
Protein
Mol. Mass.:
35855.50
Organism:
Homo sapiens (Human)
Description:
P15121. 4LAU; 2IKI; 4LB4; 2FZD; 2FZ8; 1US0
Residue:
316
  
Inhibitor
Name:
BDBM50010451
Synonyms:
But-2-enoic acid 1'-but-2-enoyloxy-8,8'-dicyano-6,7,6',7'-tetrahydroxy-5,5'-diisopropyl-3,3'-dimethyl-[2,2']binaphthalenyl-1-yl ester | CHEMBL324976
Type:
Small organic molecule
Emp. Form.:
C38H36N2O8
Mol. Mass.:
648.701
SMILES:
C\C=C\C(=O)Oc1c(c(C)cc2c(C(C)C)c(O)c(O)c(C#N)c12)-c1c(C)cc2c(C(C)C)c(O)c(O)c(C#N)c2c1OC(=O)\C=C\C
: