Target
Beta-2 adrenergic receptor
Ligand
BDBM50010556
Substrate
Meas. Tech.
ChEBML_196404
Ki
195000±n/a nM
Citation
 Leftheris, KGoodman, M Synthesis and beta-adrenergic antagonist activity of stereoisomeric practolol and propranolol derivatives. J Med Chem 33:216-23 (1990)  
Target
Name:
Beta-2 adrenergic receptor
Synonyms:
ADRB2_MOUSE Adrb2r Beta-2 adrenoceptor Beta-adrenergic receptor
Type:
PROTEIN
Mol. Mass.:
47002.38
Organism:
Mus musculus
Description:
ChEMBL_196404
Residue:
418
  
Inhibitor
Name:
BDBM50010556
Synonyms:
6-[2-Hydroxy-3-(naphthalen-1-yloxy)-propylamino]-heptanoic acid p-tolylamide(R,S) | CHEMBL308698
Type:
Small organic molecule
Emp. Form.:
C27H34N2O3
Mol. Mass.:
434.5705
SMILES:
C[C@@H](CCCCC(=O)Nc1ccc(C)cc1)NC[C@@H](O)COc1cccc2ccccc12
: