Target
Beta-2 adrenergic receptor
Ligand
BDBM50010559
Substrate
Meas. Tech.
ChEBML_196404
Ki
39000±n/a nM
Citation
 Leftheris, KGoodman, M Synthesis and beta-adrenergic antagonist activity of stereoisomeric practolol and propranolol derivatives. J Med Chem 33:216-23 (1990)  
Target
Name:
Beta-2 adrenergic receptor
Synonyms:
ADRB2_MOUSE Adrb2r Beta-2 adrenoceptor Beta-adrenergic receptor
Type:
PROTEIN
Mol. Mass.:
47002.38
Organism:
Mus musculus
Description:
ChEMBL_196404
Residue:
418
  
Inhibitor
Name:
BDBM50010559
Synonyms:
6-[2-Hydroxy-3-(naphthalen-1-yloxy)-propylamino]-heptanoic acid (4-trifluoromethyl-phenyl)-amide(S,S) | CHEMBL72707
Type:
Small organic molecule
Emp. Form.:
C27H31F3N2O3
Mol. Mass.:
488.5418
SMILES:
C[C@@H](CCCCC(=O)Nc1ccc(cc1)C(F)(F)F)NC[C@H](O)COc1cccc2ccccc12
: