Target
D(1A) dopamine receptor
Ligand
BDBM50010697
Substrate
Meas. Tech.
ChEMBL_58644 (CHEMBL666358)
Ki
<10000±n/a nM
Citation
 Gao, YGBaldessarini, RJKula, NSNeumeyer, JL Synthesis and dopamine receptor affinities of enantiomers of 2-substituted apomorphines and their N-n-propyl analogues. J Med Chem 33:1800-5 (1990)  
Target
Name:
D(1A) dopamine receptor
Synonyms:
DOPAMINE D1 Dopamine D1 high Dopamine receptor Dopamine1-like Drd1a
Type:
Enzyme Catalytic Domain
Mol. Mass.:
49429.75
Organism:
RAT
Description:
P18901
Residue:
446
  
Inhibitor
Name:
BDBM50010697
Synonyms:
(R)-(-)-2-methoxyapomorphine 2-Methoxy-6-methyl-5,6,6a,7-tetrahydro-4H-dibenzo[de,g]quinoline-10,11-diol CHEMBL53445
Type:
Small organic molecule
Emp. Form.:
C18H19NO3
Mol. Mass.:
297.3484
SMILES:
COc1cc2CCN(C)[C@@H]3Cc4ccc(O)c(O)c4-c(c1)c23
: