Target
Delta-type opioid receptor
Ligand
BDBM50010704
Substrate
Meas. Tech.
ChEBML_146866
IC50
7±n/a nM
Citation
 Kawasaki, AMKnapp, RJKramer, THWire, WSVasquez, OSYamamura, HIBurks, TFHruby, VJ Design and synthesis of highly potent and selective cyclic dynorphin A analogues. J Med Chem 33:1874-9 (1990)  
Target
Name:
Delta-type opioid receptor
Synonyms:
D-OR-1 Delta opioid receptor OPIATE Delta OPRD1 OPRK1 | opioid receptor, delta 1
Type:
G Protein-Coupled Receptor (GPCR)
Mol. Mass.:
40382.98
Organism:
Homo sapiens (Human)
Description:
Competition binding assays were carried out using membrane preparations from transfected HN9.10 cells that constitutively expressed the delta opioid receptor.
Residue:
372
  
Inhibitor
Name:
BDBM50010704
Synonyms:
CHEMBL216640 Dynorphin A analogues HTyr-Gly-Gly-Phe-Leu-Arg-Arg-lle-Arg-Pro-LysNH2 Tyr-Gly-Gly-Phe-Leu-Arg-Arg-Ile-Arg-Pro-D-Lys-NH2 | Tyr-Gly-Gly-Phe-Leu-Arg-Arg-Ile-Arg-Pro-Lys-Leu-Lys-Trp-Asp-Asn-Gln-NH2
Type:
Small organic molecule
Emp. Form.:
C63H104N22O12
Mol. Mass.:
1361.6401
SMILES:
CC[C@H](C)[C@H](NC(=O)[C@H](CCCNC(N)=N)NC(=O)[C@H](CCCNC(N)=N)NC(=O)[C@H](CC(C)C)NC(=O)[C@H](Cc1ccccc1)NC(=O)CNC(=O)CNC(=O)[C@@H](N)Cc1ccc(O)cc1)C(=O)N[C@@H](CCCNC(N)=N)C(=O)N1CCC[C@H]1C(=O)N[C@@H](CCCCN)C(N)=O
: