Target
Mu-type opioid receptor
Ligand
BDBM50010701
Substrate
Meas. Tech.
ChEBML_146979
IC50
0.362000±n/a nM
Citation
 Kawasaki, AMKnapp, RJKramer, THWire, WSVasquez, OSYamamura, HIBurks, TFHruby, VJ Design and synthesis of highly potent and selective cyclic dynorphin A analogues. J Med Chem 33:1874-9 (1990)  
Target
Name:
Mu-type opioid receptor
Synonyms:
M-OR-1 Mu opioid receptor OPIATE Mu OPRM_CAVPO
Type:
Enzyme Catalytic Domain
Mol. Mass.:
11165.58
Organism:
GUINEA PIG
Description:
P97266
Residue:
98
  
Inhibitor
Name:
BDBM50010701
Synonyms:
CHEMBL410616 | H-Tyr-Gly-Gly-Phe-Leu-Arg-Arg-D-Cys-Arg-Pro-Lys-Leu-D-Cys-NH2
Type:
Small organic molecule
Emp. Form.:
C69H112N24O14S2
Mol. Mass.:
1565.91
SMILES:
CC(C)C[C@H](NC(=O)[C@H](Cc1ccccc1)NC(=O)CNC(=O)CNC(=O)[C@@H](N)Cc1ccc(O)cc1)C(=O)N[C@@H](CCCNC(N)=N)C(=O)N[C@@H](CCCNC(N)=N)C(=O)N[C@@H]1CSSC[C@@H](NC(=O)[C@H](CC(C)C)NC(=O)[C@H](CCCCN)NC(=O)[C@@H]2CCCN2C(=O)[C@H](CCCNC(N)=N)NC1=O)C(N)=O
: