Target
Renin
Ligand
BDBM50010902
Substrate
Meas. Tech.
ChEBML_195750
IC50
1.9±n/a nM
Citation
 Bradbury, RHRivett, JE 1,2,4-Triazolo[4,3-a]pyrazine derivatives with human renin inhibitory activity. 3.1 Synthesis and biological properties of aminodeoxystatine and difluorostatone derivatives. J Med Chem 34:151-7 (1991)  
Target
Name:
Renin
Synonyms:
Angiotensinogenase RENI_HUMAN
Type:
Enzyme
Mol. Mass.:
45058.99
Organism:
Homo sapiens (Human)
Description:
Residue:
406
  
Inhibitor
Name:
BDBM50010902
Synonyms:
5-Cyclohexyl-2,2-difluoro-4-[2-(8-isobutyl-6-phenyl-[1,2,4]triazolo[4,3-a]pyrazin-3-yl)-acetylamino]-3-oxo-pentanoic acid {3-methyl-1-[(pyridin-2-ylmethyl)-carbamoyl]-butyl}-amide | CHEMBL38846
Type:
Small organic molecule
Emp. Form.:
C40H50F2N8O4
Mol. Mass.:
744.873
SMILES:
CC(C)CC(NC(=O)C(F)(F)C(=O)C(CC1CCCCC1)NC(=O)Cc1nnc2c(CC(C)C)nc(cn12)-c1ccccc1)C(=O)NCc1ccccn1
: