Target
MAP kinase-interacting serine/threonine-protein kinase 1
Ligand
BDBM164271
Substrate
Meas. Tech.
ChEBML_1697749
IC50
2.7±n/a nM
Citation
 Reich, SHSprengeler, PAChiang, GGAppleman, JRChen, JClarine, JEam, BErnst, JTHan, QGoel, VKHan, EZRHuang, VHung, INJJemison, AJessen, KAMolter, JMurphy, DNeal, MParker, GSShaghafi, MSperry, SStaunton, JStumpf, CRThompson, PATran, CWebber, SEWegerski, CJZheng, HWebster, KR Structure-based Design of Pyridone-Aminal eFT508 Targeting Dysregulated Translation by Selective Mitogen-activated Protein Kinase Interacting Kinases 1 and 2 (MNK1/2) Inhibition. J Med Chem 61:3516-3540 (2018)  
Target
Name:
MAP kinase-interacting serine/threonine-protein kinase 1
Synonyms:
MAP Kinase-Interacting Protein Kinase (MNK1) MAP kinase-interacting serine/threonine-protein kinase 1 (MnK1) MAP-kinase interacting kinase 1 (MNK1) MKNK1 MNK1
Type:
Serine/threonine-protein kinase
Mol. Mass.:
51342.85
Organism:
Homo sapiens (Human)
Description:
Q9BUB5
Residue:
465
  
Inhibitor
Name:
BDBM164271
Synonyms:
US9669031, 10 N-(6-((3,3-dimethyl-1,5-dioxo-1,2,3,5-tetrahydroimidazo[1,5-a]pyridin-6-yl)amino)pyrimidin-4-yl)cyclopropanecarboxamide (Cpd. No. 10)
Type:
Small organic molecule
Emp. Form.:
C17H18N6O3
Mol. Mass.:
354.3632
SMILES:
CC1(C)NC(=O)c2ccc(Nc3cc(NC(=O)C4CC4)ncn3)c(=O)n12
: