Target
MAP kinase-interacting serine/threonine-protein kinase 2
Ligand
BDBM50263264
Substrate
Meas. Tech.
ChEBML_1697750
IC50
7.8±n/a nM
Citation
 Reich, SHSprengeler, PAChiang, GGAppleman, JRChen, JClarine, JEam, BErnst, JTHan, QGoel, VKHan, EZRHuang, VHung, INJJemison, AJessen, KAMolter, JMurphy, DNeal, MParker, GSShaghafi, MSperry, SStaunton, JStumpf, CRThompson, PATran, CWebber, SEWegerski, CJZheng, HWebster, KR Structure-based Design of Pyridone-Aminal eFT508 Targeting Dysregulated Translation by Selective Mitogen-activated Protein Kinase Interacting Kinases 1 and 2 (MNK1/2) Inhibition. J Med Chem 61:3516-3540 (2018)  
Target
Name:
MAP kinase-interacting serine/threonine-protein kinase 2
Synonyms:
GPRK7 MAP kinase-interacting serine/threonine-protein kinase 2 (MKNK2) MAP-kinase interacting kinase 2 (MNK2) MKNK2_HUMAN | MNK2
Type:
Protein
Mol. Mass.:
51870.79
Organism:
Homo sapiens (Human)
Description:
Q9HBH9
Residue:
465
  
Inhibitor
Name:
BDBM50263264
Synonyms:
CHEMBL4094080
Type:
Small organic molecule
Emp. Form.:
C19H17N5O
Mol. Mass.:
331.3712
SMILES:
N[C@H]1C[C@@H](C1)Oc1ccc2ncc(-c3ccc4cnccc4c3)n2n1
: