Target
MAP kinase-interacting serine/threonine-protein kinase 1/2
Ligand
BDBM168214
Substrate
Meas. Tech.
ChEBML_1697751
IC50
0.310000±n/a nM
Citation
 Reich, SHSprengeler, PAChiang, GGAppleman, JRChen, JClarine, JEam, BErnst, JTHan, QGoel, VKHan, EZRHuang, VHung, INJJemison, AJessen, KAMolter, JMurphy, DNeal, MParker, GSShaghafi, MSperry, SStaunton, JStumpf, CRThompson, PATran, CWebber, SEWegerski, CJZheng, HWebster, KR Structure-based Design of Pyridone-Aminal eFT508 Targeting Dysregulated Translation by Selective Mitogen-activated Protein Kinase Interacting Kinases 1 and 2 (MNK1/2) Inhibition. J Med Chem 61:3516-3540 (2018)  
Target
Name:
MAP kinase-interacting serine/threonine-protein kinase 1/2
Synonyms:
Type:
Mol. Mass.:
Description:
ASSAY_ID of ChEMBL is 1879554
Components:
This complex has 2 components.
Component 1
Name:
MAP kinase-interacting serine/threonine-protein kinase 2
Synonyms:
GPRK7 MAP kinase-interacting serine/threonine-protein kinase 2 (MKNK2) MAP-kinase interacting kinase 2 (MNK2) MKNK2_HUMAN | MNK2
Type:
Protein
Mol. Mass.:
51870.79
Organism:
Homo sapiens (Human)
Description:
Q9HBH9
Residue:
465
  
Component 2
Name:
MAP kinase-interacting serine/threonine-protein kinase 1
Synonyms:
MAP Kinase-Interacting Protein Kinase (MNK1) MAP kinase-interacting serine/threonine-protein kinase 1 (MnK1) MAP-kinase interacting kinase 1 (MNK1) MKNK1 MNK1
Type:
Serine/threonine-protein kinase
Mol. Mass.:
51342.85
Organism:
Homo sapiens (Human)
Description:
Q9BUB5
Residue:
465
  
Inhibitor
Name:
BDBM168214
Synonyms:
US9669031, 207 6′-((6-aminopyrimidin-4-yl)amino)-8′-(hydroxymethyl)-2′H-spiro[cyclohexane-1,3′-imidazo[1,5-a]pyridine]-1′,5′-dione (Cpd. No. 207) | US9669031, 45 N-(6-((8′-chloro-1′,5′-dioxo-1′,5′-dihydro-2′H-spiro[cyclohexane-1,3′-imidazo[1,5-a]pyridin]-6′-yl)amino)pyrimidin-4-yl)cyclopropanecarboxamide (Cpd. No. 45)
Type:
Small organic molecule
Emp. Form.:
C20H21ClN6O3
Mol. Mass.:
428.872
SMILES:
Clc1cc(Nc2cc(NC(=O)C3CC3)ncn2)c(=O)n2c1C(=O)NC21CCCCC1
: