Target
Platelet-activating factor receptor
Ligand
BDBM50011081
Substrate
Meas. Tech.
ChEBML_177423
IC50
80±n/a nM
Citation
 Bartrolí, JCarceller, EMerlos, MGarcía-Rafanell, JForn, J Disubstituted tetrahydrofurans and dioxolanes and PAF antagonists. J Med Chem 34:373-86 (1991)  
Target
Name:
Platelet-activating factor receptor
Synonyms:
PAF-R PTAFR_CAVPO Platelet-activating factor receptor
Type:
Protein
Mol. Mass.:
39005.63
Organism:
Cavia porcellus
Description:
Residue:
342
  
Inhibitor
Name:
BDBM50011081
Synonyms:
2-{[Acetyl-(5-pentadecyl-tetrahydro-furan-2-ylmethoxycarbonyl)-amino]-methyl}-1-ethyl-pyridinium; iodide | CHEMBL421618
Type:
Small organic molecule
Emp. Form.:
C31H53N2O4
Mol. Mass.:
517.763
SMILES:
CCCCCCCCCCCCCCCC1CCC(COC(=O)N(Cc2cccc[n+]2CC)C(C)=O)O1
: