Target
Platelet-activating factor receptor
Ligand
BDBM50011124
Substrate
Meas. Tech.
ChEBML_177423
IC50
150000±n/a nM
Citation
 Bartrolí, JCarceller, EMerlos, MGarcía-Rafanell, JForn, J Disubstituted tetrahydrofurans and dioxolanes and PAF antagonists. J Med Chem 34:373-86 (1991)  
Target
Name:
Platelet-activating factor receptor
Synonyms:
PAF-R PTAFR_CAVPO Platelet-activating factor receptor
Type:
Protein
Mol. Mass.:
39005.63
Organism:
Cavia porcellus
Description:
Residue:
342
  
Inhibitor
Name:
BDBM50011124
Synonyms:
CHEMBL124512 | Toluene-4-sulfonate3-[5-(2-methyl-[1,3]dioxolan-4-ylmethoxycarbonyl)-pentyl]-thiazol-3-ium;Toluene-4-sulfonate
Type:
Small organic molecule
Emp. Form.:
C14H22NO4S
Mol. Mass.:
300.393
SMILES:
CC1OCC(COC(=O)CCCCC[n+]2ccsc2)O1
: