Target
Platelet-activating factor receptor
Ligand
BDBM50011058
Substrate
Meas. Tech.
ChEMBL_177423 (CHEMBL784402)
IC50
14±n/a nM
Citation
 Bartrolí, JCarceller, EMerlos, MGarcía-Rafanell, JForn, J Disubstituted tetrahydrofurans and dioxolanes and PAF antagonists. J Med Chem 34:373-86 (1991)  
Target
Name:
Platelet-activating factor receptor
Synonyms:
PAF-R PTAFR_CAVPO Platelet-activating factor receptor
Type:
Protein
Mol. Mass.:
39005.63
Organism:
Cavia porcellus
Description:
Residue:
342
  
Inhibitor
Name:
BDBM50011058
Synonyms:
CHEMBL124534 | Tetrahydrofuran derivative
Type:
Small organic molecule
Emp. Form.:
C33H56N3O6
Mol. Mass.:
590.8137
SMILES:
CCCCCCCCCCCCCCCNOC(=O)CC1CC(COC(=O)N(Cc2cccc[n+]2CC)C(C)=O)CO1
: