Target
Melanocyte-stimulating hormone receptor
Ligand
BDBM50027084
Substrate
Meas. Tech.
ChEMBL_1698288 (CHEMBL4049178)
Ki
0.112202±n/a nM
Citation
 Durek, TCromm, PMWhite, AMSchroeder, CIKaas, QWeidmann, JAhmad Fuaad, ACheneval, OHarvey, PJDaly, NLZhou, YDellsén, AÖsterlund, TLarsson, NKnerr, LBauer, UKessler, HCai, MHruby, VJPlowright, ATCraik, DJ Development of Novel Melanocortin Receptor Agonists Based on the Cyclic Peptide Framework of Sunflower Trypsin Inhibitor-1. J Med Chem 61:3674-3684 (2018)  
Target
Name:
Melanocyte-stimulating hormone receptor
Synonyms:
MC1-R MSH-R MSHR_HUMAN Melanocortin receptor (M1 and M4) Melanocortin receptor 1 (MC1-R) | Melanocortin receptor 1 (MC1R)
Type:
Enzyme
Mol. Mass.:
34717.23
Organism:
Homo sapiens (Human)
Description:
Q01726
Residue:
317
  
Inhibitor
Name:
BDBM50027084
Synonyms:
Melatonan
Type:
Small organic molecule
Emp. Form.:
C50H69N15O9
Mol. Mass.:
1024.178
SMILES:
CCCC[C@H](NC(C)=O)C(=O)N[C@H]1CC(=O)NCCCC[C@H](NC(=O)[C@H](Cc2c[nH]c3ccccc23)NC(=O)[C@H](CCCNC(N)=N)NC(=O)[C@@H](Cc2ccccc2)NC(=O)[C@H](Cc2cnc[nH]2)NC1=O)C(N)=O
: