Target
Adenosine receptor A1
Ligand
BDBM50004590
Substrate
Meas. Tech.
ChEMBL_29295 (CHEMBL640356)
Ki
7400±n/a nM
Citation
 Shimada, JSuzuki, FNonaka, HKarasawa, AMizumoto, HOhno, TKubo, KIshii, A 8-(Dicyclopropylmethyl)-1,3-dipropylxanthine: a potent and selective adenosine A1 antagonist with renal protective and diuretic activities. J Med Chem 34:466-9 (1991)  
Target
Name:
Adenosine receptor A1
Synonyms:
A1 adenosine receptor ADENOSINE A1 ADENOSINE A1 low Adenosine A1 receptor | Adenosine Receptor A1
Type:
Enzyme Catalytic Domain
Mol. Mass.:
36501.39
Organism:
GUINEA PIG
Description:
ADENOSINE A1 ADORA1 GUINEA PIG::P47745
Residue:
326
  
Inhibitor
Name:
BDBM50004590
Synonyms:
8-Dicyclopropylmethyl-7-methyl-1,3-dipropyl-3,7-dihydro-purine-2,6-dione | CHEMBL102372
Type:
Small organic molecule
Emp. Form.:
C19H28N4O2
Mol. Mass.:
344.4512
SMILES:
CCCn1c2nc(C(C3CC3)C3CC3)n(C)c2c(=O)n(CCC)c1=O
: