Target
Adenosine receptor A2a/A2b
Ligand
BDBM50004594
Substrate
Meas. Tech.
ChEMBL_31035 (CHEMBL638323)
Ki
2700±n/a nM
Citation
 Shimada, JSuzuki, FNonaka, HKarasawa, AMizumoto, HOhno, TKubo, KIshii, A 8-(Dicyclopropylmethyl)-1,3-dipropylxanthine: a potent and selective adenosine A1 antagonist with renal protective and diuretic activities. J Med Chem 34:466-9 (1991)  
Target
Name:
Adenosine receptor A2a/A2b
Synonyms:
Adenosine A2 receptor
Type:
Mol. Mass.:
Description:
ASSAY_ID of ChEMBL is 30560
Components:
This complex has 2 components.
Component 1
Name:
Adenosine receptor A2b
Synonyms:
AA2BR_RAT Adora2b
Type:
PROTEIN
Mol. Mass.:
36378.84
Organism:
Rattus norvegicus
Description:
ChEMBL_32934
Residue:
332
  
Component 2
Name:
Adenosine receptor A2a
Synonyms:
AA2AR_RAT Adenosine A2 receptor Adenosine Receptors A2a (A2a) Adenosine receptors A2a Rat striatal adenosine A2a receptor
Type:
G Protein-Coupled Receptor (GPCR)
Mol. Mass.:
45015.65
Organism:
Rattus norvegicus (rat)
Description:
Rat A2A receptors expressed in CHO cells.
Residue:
410
  
Inhibitor
Name:
BDBM50004594
Synonyms:
8-Dicyclopropylmethyl-1,3-dimethyl-3,7-dihydro-purine-2,6-dione | CHEMBL106937
Type:
Small organic molecule
Emp. Form.:
C14H18N4O2
Mol. Mass.:
274.3183
SMILES:
Cn1c2nc([nH]c2c(=O)n(C)c1=O)C(C1CC1)C1CC1
: