Target
Renin
Ligand
BDBM50011228
Substrate
Meas. Tech.
ChEMBL_195748 (CHEMBL878548)
pH
6.5±n/a
IC50
0.990000±n/a nM
Comments
extracted
Citation
 Rosenberg, SHKleinert, HDStein, HHMartin, DLChekal, MACohen, JEgan, DATricarico, KABaker, WR Design of a well-absorbed renin inhibitor. J Med Chem 34:469-71 (1991)  
Target
Name:
Renin
Synonyms:
Angiotensinogenase RENI_HUMAN
Type:
Enzyme
Mol. Mass.:
45058.99
Organism:
Homo sapiens (Human)
Description:
Residue:
406
  
Inhibitor
Name:
BDBM50011228
Synonyms:
(R)-2-Benzyl-N-[(S)-1-[(1S,2R)-1-cyclohexylmethyl-2-((S)-3-ethyl-2-oxo-oxazolidin-5-yl)-2-hydroxy-ethylcarbamoyl]-2-(3H-imidazol-4-yl)-ethyl]-4-morpholin-4-yl-4-oxo-butyramide CHEMBL345043
Type:
Small organic molecule
Emp. Form.:
C35H50N6O7
Mol. Mass.:
666.8075
SMILES:
CCN1C[C@H](OC1=O)[C@H](O)[C@H](CC1CCCCC1)NC(=O)[C@H](Cc1cnc[nH]1)NC(=O)[C@@H](CC(=O)N1CCOCC1)Cc1ccccc1
: