Target
Tyrosine-protein kinase ZAP-70
Ligand
BDBM2579
Substrate
Meas. Tech.
ChEMBL_1699219 (CHEMBL4050201)
IC50
12.4±n/a nM
Citation
 Sugimoto, YSawant, DBFisk, HAMao, LLi, CChettiar, SLi, PKDarby, MVBrueggemeier, RW Novel pyrrolopyrimidines as Mps1/TTK kinase inhibitors for breast cancer. Bioorg Med Chem 25:2156-2166 (2017)  
Target
Name:
Tyrosine-protein kinase ZAP-70
Synonyms:
70 kDa zeta-associated protein Syk-related tyrosine kinase Tyrosine-protein kinase ZAP-70 Tyrosine-protein kinase ZAP-70 (ZAP70) ZAP70 Zeta-chain (TCR) associated protein kinase 70kDa
Type:
Enzyme
Mol. Mass.:
69881.61
Organism:
Homo sapiens (Human)
Description:
ZAP-70 SH2 domain was expressed and purified from E. coli using O-phospho-L-tyrosine-agarose column.
Residue:
619
  
Inhibitor
Name:
BDBM2579
Synonyms:
(2S,3R,4R,6R)-3-methoxy-2-methyl-4-(methylamino)-29-oxa-1,7,17-triazaoctacyclo[12.12.2.1^{2,6}.0^{7,28}.0^{8,13}.0^{15,19}.0^{20,27}.0^{21,26}]nonacosa-8(13),9,11,14(28),15(19),20(27),21(26),22,24-nonaen-16-one Staurosporin, 4 Staurosporine, 8 US9206188, Staurosporine | US9226923, Staurosporine
Type:
Small organic molecule
Emp. Form.:
C28H26N4O3
Mol. Mass.:
466.531
SMILES:
CN[C@@H]1C[C@H]2O[C@@](C)([C@@H]1OC)n1c3ccccc3c3c4CNC(=O)c4c4c5ccccc5n2c4c13
: