Target
Dual specificity protein kinase TTK
Ligand
BDBM50264843
Substrate
Meas. Tech.
ChEMBL_1699202 (CHEMBL4050184)
IC50
13152±n/a nM
Citation
 Sugimoto, YSawant, DBFisk, HAMao, LLi, CChettiar, SLi, PKDarby, MVBrueggemeier, RW Novel pyrrolopyrimidines as Mps1/TTK kinase inhibitors for breast cancer. Bioorg Med Chem 25:2156-2166 (2017)  
Target
Name:
Dual specificity protein kinase TTK
Synonyms:
Dual specificity protein kinase (TTK) MPS1 Monopolar Spindle 1 (MPS1) Monopolar Spindle 1 Kinase (MPS1) TTK | TTK_HUMAN
Type:
Protein
Mol. Mass.:
97086.79
Organism:
Homo sapiens (Human)
Description:
P33981
Residue:
857
  
Inhibitor
Name:
BDBM50264843
Synonyms:
CHEMBL4091309
Type:
Small organic molecule
Emp. Form.:
C26H30N6O4S
Mol. Mass.:
522.619
SMILES:
COc1cc(ccc1Nc1nc(Nc2ccccc2S(=O)(=O)C(C)C)c2cc[nH]c2n1)N1CCOCC1
: