Target
Trifunctional purine biosynthetic protein adenosine-3
Ligand
BDBM50011325
Substrate
Meas. Tech.
ChEMBL_72914 (CHEMBL684728)
IC50
>20000±n/a nM
Citation
 Gangjee, ADonkor, IOKisliuk, RLGaumont, YThorndike, J Synthesis and biological activity of 5,11-methylenetetrahydro-5- deazahomofolic acid. J Med Chem 34:611-6 (1991)  
Target
Name:
Trifunctional purine biosynthetic protein adenosine-3
Synonyms:
GAR Tfase GART Glycinamide ribonucleotide transformylase (GAR Tfase) PRGS Thymidylate synthase/GAR transformylase/AICAR transformylase
Type:
Protein
Mol. Mass.:
107768.47
Organism:
Homo sapiens (Human)
Description:
P22102
Residue:
1010
  
Inhibitor
Name:
BDBM50011325
Synonyms:
2-[4-(2-Amino-4-oxo-4,4b,5,7,8,8a,9,10-octahydro-3H-1,3,6,10-tetraaza-phenanthren-6-yl)-benzoylamino]-pentanedioic acid | CHEMBL158034
Type:
Small organic molecule
Emp. Form.:
C22H26N6O6
Mol. Mass.:
470.4784
SMILES:
Nc1nc2NCC3CCN(CC3c2c(=O)[nH]1)c1ccc(cc1)C(=O)NC(CCC(O)=O)C(O)=O
: