Target
Renin
Ligand
BDBM50011348
Substrate
Meas. Tech.
ChEBML_195778
IC50
0.430000±n/a nM
Citation
 Thaisrivongs, SPals, DTDuCharme, DWTurner, SRDeGraaf, GLLawson, JACouch, SJWilliams, MV Renin inhibitory peptides. Incorporation of polar, hydrophilic end groups into an active renin inhibitory peptide template and their evaluation in a human renin infused rat model and in conscious sodium-depleted monkeys. J Med Chem 34:633-42 (1991)  
Target
Name:
Renin
Synonyms:
Angiotensinogenase RENI_HUMAN
Type:
Enzyme
Mol. Mass.:
45058.99
Organism:
Homo sapiens (Human)
Description:
Residue:
406
  
Inhibitor
Name:
BDBM50011348
Synonyms:
5-[2-{[2-(3-Amino-3-methyl-butyrylamino)-3-phenyl-propionyl]-methyl-amino}-3-(3H-imidazol-4-yl)-propionylamino]-6-cyclohexyl-4-hydroxy-2-isopropyl-hexanoic acid {2-methyl-1-[(1-oxy-pyridin-2-ylmethyl)-carbamoyl]-butyl}-amide | CHEMBL3143479
Type:
Small organic molecule
Emp. Form.:
C48H73N9O7
Mol. Mass.:
888.1493
SMILES:
CC[C@H](C)[C@H](NC(=O)[C@@H](C[C@H](O)[C@H](CC1CCCCC1)NC(=O)[C@H](Cc1c[nH]cn1)N(C)C(=O)[C@H](Cc1ccccc1)NC(=O)CC(C)(C)N)C(C)C)C(=O)NCc1cccc[n+]1[O-]
: