Target
Mitogen-activated protein kinase 1
Ligand
BDBM120095
Substrate
Meas. Tech.
ChEMBL_1700376 (CHEMBL4051358)
IC50
86±n/a nM
Citation
 Ward, RABethel, PCook, CDavies, EDebreczeni, JEFairley, GFeron, LFlemington, VGraham, MAGreenwood, RGriffin, NHanson, LHopcroft, PHoward, TDHudson, JJames, MJones, CDJones, CRLamont, SLewis, RLindsay, NRoberts, KSimpson, ISt-Gallay, SSwallow, STang, JTonge, MWang, ZZhai, B Structure-Guided Discovery of Potent and Selective Inhibitors of ERK1/2 from a Modestly Active and Promiscuous Chemical Start Point. J Med Chem 60:3438-3450 (2017)  
Target
Name:
Mitogen-activated protein kinase 1
Synonyms:
ERK2 Extracellular signal-regulated kinase 2 Extracellular signal-regulated kinase 2 (ERK2) MAPK 2 MK01_HUMAN Mitogen-activated protein kinase 1 (ERK-2) Mitogen-activated protein kinase 2 PRKM2 | p42-MAPK
Type:
Ser/Thr Protein Kinase
Mol. Mass.:
41392.76
Organism:
Homo sapiens (Human)
Description:
P28482
Residue:
360
  
Inhibitor
Name:
BDBM120095
Synonyms:
US10525036, Example GDC-0994 US8697715, 39 | US9259470, 39
Type:
Small organic molecule
Emp. Form.:
C21H18ClFN6O2
Mol. Mass.:
440.858
SMILES:
Cn1nccc1Nc1nccc(n1)-c1ccn([C@H](CO)c2ccc(Cl)c(F)c2)c(=O)c1
: